スポンサーサイト

上記の広告は1ヶ月以上更新のないブログに表示されています。
新しい記事を書く事で広告が消せます。
総合案内当ブログについて
Windowsの目次Linuxの目次Linuxの目次2・ ・自作PC関連の目次Web技術関連の目次
全記事一覧情報サイト新着RSS一覧

Sponsored Link

Linux用のベンチマークソフトHDbench clone導入は結構苦難

まだ途中です。Linuxでも使えるGUIの総合ベンチマークソフトとのこと。
早速インストールしようかとしたところエラーの嵐w

http://www.vector.co.jp/soft/dl/unix/hardware/se102164.html
Vectorで配布してます。

参考
http://forum.ubuntulinux.jp/viewtopic.php?pid=1140

# cd hdbench-0.14.0
# ./configure
# make
# make install


これが通ればおkなんですが必要なパッケージが他にたくさんある様子です。


DLしてhomeに置いて解凍(ここに展開)
めんどいのでRoot端末で行きました。

# cd hdbench-0.14.0
# ./configure
configure: error: Cannot find GTK: Is gtk-config in path?


ここでエラー

# apt-get install libglib1.2-dev libgtk1.2 libgtk1.2-common libgtk1.2-dev


このパッケージが必要だったらしい。

(多分この辺で参考リンク先に上がってたパッケージもいくつか入れる)

で、再挑戦

# cd hdbench-0.14.0
# ./configure


エラーはでない。

# make
(省略)
make[2]: *** [benchcpu.o] エラー 1
make[2]: ディレクトリ `/home/tmin/hdbench-0.14.0/src' から出ます
make[1]: *** [all-recursive] エラー 1
make[1]: ディレクトリ `/home/tmin/hdbench-0.14.0' から出ます
make: *** [all-recursive-am] エラー 2


ここでまたエラー

ダメモトで

# make install
make: *** ターゲット `inatall' を make するルールがありません. 中止.


・・・OTL。
gtk+-develが必要?

# apt-get install gtk+-devel gcc
パッケージリストを読み込んでいます... 完了
依存関係ツリーを作成しています
状態情報を読み取っています... 完了
E: パッケージ gtk+-devel が見つかりません


っておいww

もうちょっと調べて再挑戦します。。。


追記

benchcpu.s:30: Error: suffix or operands invalid for `push'
benchcpu.s:31: Error: suffix or operands invalid for `push'
benchcpu.s:32: Error: suffix or operands invalid for `push'
benchcpu.s:41: Error: suffix or operands invalid for `push'
benchcpu.s:73: Error: suffix or operands invalid for `pop'
benchcpu.s:80: Error: suffix or operands invalid for `pop'
benchcpu.s:81: Error: suffix or operands invalid for `pop'
benchcpu.s:82: Error: suffix or operands invalid for `pop'
benchcpu.s:90: Error: suffix or operands invalid for `push'
benchcpu.s:91: Error: suffix or operands invalid for `push'
benchcpu.s:92: Error: suffix or operands invalid for `push'
benchcpu.s:134: Error: suffix or operands invalid for `pop'
benchcpu.s:135: Error: suffix or operands invalid for `pop'
benchcpu.s:136: Error: suffix or operands invalid for `pop'
benchcpu.s:144: Error: suffix or operands invalid for `push'
benchcpu.s:147: Error: suffix or operands invalid for `push'
benchcpu.s:148: Error: suffix or operands invalid for `push'
benchcpu.s:149: Error: suffix or operands invalid for `push'
benchcpu.s:150: Error: suffix or operands invalid for `push'
benchcpu.s:151: Error: suffix or operands invalid for `push'
benchcpu.s:163: Error: suffix or operands invalid for `push'
benchcpu.s:168: Error: suffix or operands invalid for `pop'
benchcpu.s:176: Error: suffix or operands invalid for `pop'
benchcpu.s:177: Error: suffix or operands invalid for `pop'
benchcpu.s:178: Error: suffix or operands invalid for `pop'
benchcpu.s:179: Error: suffix or operands invalid for `pop'
benchcpu.s:180: Error: suffix or operands invalid for `pop'
benchcpu.s:183: Error: suffix or operands invalid for `pop'
make[2]: *** [benchcpu.o] エラー 1
make[2]: ディレクトリ `/home/tmin/hdbench-0.14.0/src' から出ます
make[1]: *** [all-recursive] エラー 1
make[1]: ディレクトリ `/home/tmin/hdbench-0.14.0' から出ます
make: *** [all-recursive-am] エラー 2


どーしてもここでエラーが出てしまう。
俺の環境じゃ無理なのかもしれません?

追記
同じ手順で導入できたという情報が。その方はPenDで32bitUbuntu。
俺の環境に問題ありそうな予感がバシバシしますw
試してみたかた情報いただけたらありがたいです。



関連記事
Linux用総合ベンチマーク phoronix-test-suite をUbuntuに導入
Ubuntuでシステム詳細&簡易ベンチマーク ~Hard Info~
関連記事
総合案内当ブログについて
Windowsの目次Linuxの目次Linuxの目次2・ ・自作PC関連の目次Web技術関連の目次
全記事一覧情報サイト新着RSS一覧

Sponsored Link

コメントの投稿

管理者にだけ表示を許可する
ブログ内検索

カスタム検索

フリーエリア

クリックで救える命がある。

レンタルサーバー

さくらのマネージドサーバ
さくらインターネットのVPS
ConoHaのVPS
WebARENA VPSクラウド
99円レンタルサーバー
【CloudCore VPS】
GMOクラウドのレンタルサーバー
転送量無制限 ABLENET
@WAPPYレンタルサーバー
SPPDレンタルサーバー

カテゴリー+月別アーカイブ

 

アクセスカウンター

現在の閲覧者数:

プロフィール

Author:tmin
PCヲタ。ライト2ちゃんねら。
スロット好きのギャンブラー。(元
むしろ人生がギャンブルだが目下のところ負けっぱなし。
座右の銘は「結果オーライ」。故に基本適当。
トラブルもまた楽しみのひとつ

コメント、トラバ、相互リンク歓迎。お気軽にどうぞ。
当ブログについて
Twitterでこっちとあっちの更新情報流すことにしてみます。
http://twitter.com/t_min
Project Mikunchu♪Wikiできました。
Mikunchu200x40.png


上記広告は1ヶ月以上更新のないブログに表示されています。新しい記事を書くことで広告を消せます。